SKS compile error

Previous Topic Next Topic
 
classic Classic list List threaded Threaded
1 message Options
Reply | Threaded
Open this post in threaded view
|

SKS compile error

omar rami
Dear All,

Am compiling sks source code but am getting this error when excuting the "make" command:

stubs-zlib.c: In function `caml_zlib_inflateEnd':
stubs-zlib.c:174: warning: implicit declaration of function `inflateEnd'
stubs-zlib.c:174: error: `z_stream' undeclared (first use in this function)
stubs-zlib.c:174: error: syntax error before ')' token
stubs-zlib.c:174: error: `Z_OK' undeclared (first use in this function)
make[1]: *** [stubs-zlib.o] Error 2
make[1]: Leaving directory `/home/rami/Desktop/SKS Project/sks-1.0.10/cryptokit-1.0'
make: *** [cryptokit-1.0/cryptokit.cma] Error 2



----------------------------
Anybody has an idea plz reply



_______________________________________________
Sks-devel mailing list
[hidden email]
http://lists.nongnu.org/mailman/listinfo/sks-devel